{"text_format":"1","workbook":"xlsx","n_sheets":3,"sheets":["Sheet1","Data","Dictionary"],"not_rendered":{"charts":0,"images":2,"macros":1,"external_links":1,"defined_names":2,"comments":1,"pivot_tables":0},"unopened":[],"bounds":{"document_bytes":16777216,"sheet_cells":100000,"rows_first":2000,"rows_last":500,"rows_between":2000,"halvings":0,"cell_chars":16384,"cell_head_chars":4096},"cells_cut":0,"cells_raw":0,"read":"whole","date_system":"1900"}

{"sheet":"Sheet1","index":0,"n_rows":69,"n_cols":15,"rows_kept":69,"cut":false,"hidden":false,"merged":[[68,1,69,15],[3,3,3,14],[5,3,5,14],[5,1,5,2],[38,2,39,3],[45,5,45,7],[64,12,64,13],[52,12,52,13],[53,12,53,13],[54,12,54,13],[0,13,0,14],[1,13,1,14],[2,1,2,14],[1,2,1,12],[43,5,43,8],[23,5,23,7],[3,1,3,2],[26,5,26,10]]}
[null,null,null,null,null,null,null,null,null,null,null,null,null,{"$f":"NOW()","v":"2019-04-09T14:38:50.340"}]
[null,null,{"$f":"INDEX(Dictionary!$1:$1048576,1,1+INDEX(Data!$T:$T,MATCH(Sheet1!$N$2,Data!$R:$R,0)))","v":"Heat recovery system quotation request"},null,null,null,null,null,null,null,null,null,null,"[EN]"]
[null,{"$f":"INDEX(Dictionary!$1:$1048576,2,1+INDEX(Data!$T:$T,MATCH(Sheet1!$N$2,Data!$R:$R,0)))","v":"(please sent filled questionnaire to your regional sales manager)"}]
[null,{"$f":"INDEX(Dictionary!$1:$1048576,3,1+INDEX(Data!$T:$T,MATCH(Sheet1!$N$2,Data!$R:$R,0)))","v":"Project name: "},null,{"$f":"INDEX(Dictionary!$1:$1048576,5,1+INDEX(Data!$T:$T,MATCH(Sheet1!$N$2,Data!$R:$R,0)))","v":"n/a"}]
[]
[null,{"$f":"INDEX(Dictionary!$1:$1048576,4,1+INDEX(Data!$T:$T,MATCH(Sheet1!$N$2,Data!$R:$R,0)))","v":"Customer: "},null,{"$f":"INDEX(Dictionary!$1:$1048576,5,1+INDEX(Data!$T:$T,MATCH(Sheet1!$N$2,Data!$R:$R,0)))","v":"n/a"}]
[]
[null,{"$f":"INDEX(Dictionary!$1:$1048576,6,1+INDEX(Data!$T:$T,MATCH(Sheet1!$N$2,Data!$R:$R,0)))","v":"Design priority:"},null,null,null,{"$f":"INDEX(Dictionary!$1:$1048576,8,1+INDEX(Data!$T:$T,MATCH(Sheet1!$N$2,Data!$R:$R,0)))","v":"Price"},null,null,{"$f":"INDEX(Dictionary!$1:$1048576,12,1+INDEX(Data!$T:$T,MATCH(Sheet1!$N$2,Data!$R:$R,0)))","v":"Efficiency (recover as much heat as possible)"}]
[]
[null,{"$f":"INDEX(Dictionary!$1:$1048576,7,1+INDEX(Data!$T:$T,MATCH(Sheet1!$N$2,Data!$R:$R,0)))","v":"Application:"},null,null,null,{"$f":"INDEX(Dictionary!$1:$1048576,9,1+INDEX(Data!$T:$T,MATCH(Sheet1!$N$2,Data!$R:$R,0)))","v":"Domestic water heating "}]
[null,null,null,null,null,{"$f":"INDEX(Dictionary!$1:$1048576,10,1+INDEX(Data!$T:$T,MATCH(Sheet1!$N$2,Data!$R:$R,0)))","v":"Heating (technical) water heating"}]
[null,null,null,null,null,{"$f":"INDEX(Dictionary!$1:$1048576,11,1+INDEX(Data!$T:$T,MATCH(Sheet1!$N$2,Data!$R:$R,0)))","v":"Domestic and heating water heating (combi systems)"}]
[]
[null,{"$f":"INDEX(Dictionary!$1:$1048576,13,1+INDEX(Data!$T:$T,MATCH(Sheet1!$N$2,Data!$R:$R,0)))","v":"Design conditions"}]
[]
[null,null,{"$f":"INDEX(Dictionary!$1:$1048576,14,1+INDEX(Data!$T:$T,MATCH(Sheet1!$N$2,Data!$R:$R,0)))","v":"Restrictions for installation (max.):"},null,{"$f":"INDEX(Dictionary!$1:$1048576,17,1+INDEX(Data!$T:$T,MATCH(Sheet1!$N$2,Data!$R:$R,0)))","v":"L"},null,{"$f":"INDEX(Dictionary!$1:$1048576,18,1+INDEX(Data!$T:$T,MATCH(Sheet1!$N$2,Data!$R:$R,0)))","v":"mm      x"},{"$f":"INDEX(Dictionary!$1:$1048576,19,1+INDEX(Data!$T:$T,MATCH(Sheet1!$N$2,Data!$R:$R,0)))","v":"W"},null,{"$f":"INDEX(Dictionary!$1:$1048576,18,1+INDEX(Data!$T:$T,MATCH(Sheet1!$N$2,Data!$R:$R,0)))","v":"mm      x"},{"$f":"INDEX(Dictionary!$1:$1048576,20,1+INDEX(Data!$T:$T,MATCH(Sheet1!$N$2,Data!$R:$R,0)))","v":"H"},null,{"$f":"INDEX(Dictionary!$1:$1048576,118,1+INDEX(Data!$T:$T,MATCH(Sheet1!$N$2,Data!$R:$R,0)))","v":"mm"}]
[null,null,{"$f":"INDEX(Dictionary!$1:$1048576,15,1+INDEX(Data!$T:$T,MATCH(Sheet1!$N$2,Data!$R:$R,0)))","v":"Installation"},null,null,{"$f":"INDEX(Dictionary!$1:$1048576,21,1+INDEX(Data!$T:$T,MATCH(Sheet1!$N$2,Data!$R:$R,0)))","v":"indoors"},null,null,{"$f":"INDEX(Dictionary!$1:$1048576,23,1+INDEX(Data!$T:$T,MATCH(Sheet1!$N$2,Data!$R:$R,0)))","v":"outdoors"}]
[null,null,{"$f":"INDEX(Dictionary!$1:$1048576,16,1+INDEX(Data!$T:$T,MATCH(Sheet1!$N$2,Data!$R:$R,0)))","v":"Position"},null,null,{"$f":"INDEX(Dictionary!$1:$1048576,22,1+INDEX(Data!$T:$T,MATCH(Sheet1!$N$2,Data!$R:$R,0)))","v":"vertical"},null,null,{"$f":"INDEX(Dictionary!$1:$1048576,24,1+INDEX(Data!$T:$T,MATCH(Sheet1!$N$2,Data!$R:$R,0)))","v":"horizontal"}]
[]
[null,{"$f":"INDEX(Dictionary!$1:$1048576,25,1+INDEX(Data!$T:$T,MATCH(Sheet1!$N$2,Data!$R:$R,0)))","v":"Tank"}]
[]
[null,null,{"$f":"INDEX(Dictionary!$1:$1048576,26,1+INDEX(Data!$T:$T,MATCH(Sheet1!$N$2,Data!$R:$R,0)))","v":"Approx. hot water consumption"},null,null,{"$f":"INDEX(Dictionary!$1:$1048576,5,1+INDEX(Data!$T:$T,MATCH(Sheet1!$N$2,Data!$R:$R,0)))","v":"n/a"},{"$f":"INDEX(Dictionary!$1:$1048576,34,1+INDEX(Data!$T:$T,MATCH(Sheet1!$N$2,Data!$R:$R,0)))","v":"ltr./day"}]
[null,null,{"$f":"INDEX(Dictionary!$1:$1048576,27,1+INDEX(Data!$T:$T,MATCH(Sheet1!$N$2,Data!$R:$R,0)))","v":"Peak consumption of hot water"},null,null,{"$f":"INDEX(Dictionary!$1:$1048576,5,1+INDEX(Data!$T:$T,MATCH(Sheet1!$N$2,Data!$R:$R,0)))","v":"n/a"},{"$f":"INDEX(Dictionary!$1:$1048576,35,1+INDEX(Data!$T:$T,MATCH(Sheet1!$N$2,Data!$R:$R,0)))","v":"ltr./hour"}]
[null,null,{"$f":"INDEX(Dictionary!$1:$1048576,28,1+INDEX(Data!$T:$T,MATCH(Sheet1!$N$2,Data!$R:$R,0)))","v":"Fluid (%)"},null,null,"<select>",null,null,100,{"$f":"INDEX(Dictionary!$1:$1048576,36,1+INDEX(Data!$T:$T,MATCH(Sheet1!$N$2,Data!$R:$R,0)))","v":"%"}]
[null,null,{"$f":"INDEX(Dictionary!$1:$1048576,29,1+INDEX(Data!$T:$T,MATCH(Sheet1!$N$2,Data!$R:$R,0)))","v":"Fluid temperatures"},null,{"$f":"INDEX(Dictionary!$1:$1048576,38,1+INDEX(Data!$T:$T,MATCH(Sheet1!$N$2,Data!$R:$R,0)))","v":"in:"},{"$f":"INDEX(Dictionary!$1:$1048576,5,1+INDEX(Data!$T:$T,MATCH(Sheet1!$N$2,Data!$R:$R,0)))","v":"n/a"},{"$f":"INDEX(Dictionary!$1:$1048576,37,1+INDEX(Data!$T:$T,MATCH(Sheet1!$N$2,Data!$R:$R,0)))","v":"°C"},{"$f":"INDEX(Dictionary!$1:$1048576,39,1+INDEX(Data!$T:$T,MATCH(Sheet1!$N$2,Data!$R:$R,0)))","v":"out:"},{"$f":"INDEX(Dictionary!$1:$1048576,5,1+INDEX(Data!$T:$T,MATCH(Sheet1!$N$2,Data!$R:$R,0)))","v":"n/a"},{"$f":"INDEX(Dictionary!$1:$1048576,37,1+INDEX(Data!$T:$T,MATCH(Sheet1!$N$2,Data!$R:$R,0)))","v":"°C"}]
[null,null,{"$f":"INDEX(Dictionary!$1:$1048576,30,1+INDEX(Data!$T:$T,MATCH(Sheet1!$N$2,Data!$R:$R,0)))","v":"Buffer tank volume"},null,null,"<select>",{"$f":"INDEX(Dictionary!$1:$1048576,40,1+INDEX(Data!$T:$T,MATCH(Sheet1!$N$2,Data!$R:$R,0)))","v":"ltr."}]
[null,null,{"$f":"INDEX(Dictionary!$1:$1048576,31,1+INDEX(Data!$T:$T,MATCH(Sheet1!$N$2,Data!$R:$R,0)))","v":"Material"},null,null,"S235JRG2 (1.0038) carbon steel outside painted "]
[null,null,{"$f":"INDEX(Dictionary!$1:$1048576,32,1+INDEX(Data!$T:$T,MATCH(Sheet1!$N$2,Data!$R:$R,0)))","v":"Max. working pressure (Pmax.)"},null,null,{"$f":"INDEX(Dictionary!$1:$1048576,41,1+INDEX(Data!$T:$T,MATCH(Sheet1!$N$2,Data!$R:$R,0)))","v":"6 bar"},null,null,{"$f":"INDEX(Dictionary!$1:$1048576,43,1+INDEX(Data!$T:$T,MATCH(Sheet1!$N$2,Data!$R:$R,0)))","v":"10 bar"}]
[null,null,{"$f":"INDEX(Dictionary!$1:$1048576,33,1+INDEX(Data!$T:$T,MATCH(Sheet1!$N$2,Data!$R:$R,0)))","v":"Insulation"},null,null,{"$f":"INDEX(Dictionary!$1:$1048576,42,1+INDEX(Data!$T:$T,MATCH(Sheet1!$N$2,Data!$R:$R,0)))","v":"None"},null,null,{"$f":"INDEX(Dictionary!$1:$1048576,44,1+INDEX(Data!$T:$T,MATCH(Sheet1!$N$2,Data!$R:$R,0)))","v":"100 mm soft PU foam covered with PVC jacket"}]
[]
[null,{"$f":"INDEX(Dictionary!$1:$1048576,45,1+INDEX(Data!$T:$T,MATCH(Sheet1!$N$2,Data!$R:$R,0)))","v":"Refrigeration circuit"}]
[]
[null,null,{"$f":"INDEX(Dictionary!$1:$1048576,46,1+INDEX(Data!$T:$T,MATCH(Sheet1!$N$2,Data!$R:$R,0)))","v":"Number of circuits"},null,null,{"$f":"INDEX(Dictionary!$1:$1048576,53,1+INDEX(Data!$T:$T,MATCH(Sheet1!$N$2,Data!$R:$R,0)))","v":"input #1"},null,null,{"$f":"INDEX(Dictionary!$1:$1048576,54,1+INDEX(Data!$T:$T,MATCH(Sheet1!$N$2,Data!$R:$R,0)))","v":"input #2"},null,null,{"$f":"INDEX(Dictionary!$1:$1048576,55,1+INDEX(Data!$T:$T,MATCH(Sheet1!$N$2,Data!$R:$R,0)))","v":"input #3"}]
[null,null,{"$f":"INDEX(Dictionary!$1:$1048576,47,1+INDEX(Data!$T:$T,MATCH(Sheet1!$N$2,Data!$R:$R,0)))","v":"Cooling capacity"},{"$f":"INDEX(Dictionary!$1:$1048576,52,1+INDEX(Data!$T:$T,MATCH(Sheet1!$N$2,Data!$R:$R,0)))","v":"or ↘"},null,{"$f":"INDEX(Dictionary!$1:$1048576,5,1+INDEX(Data!$T:$T,MATCH(Sheet1!$N$2,Data!$R:$R,0)))","v":"n/a"},{"$f":"INDEX(Dictionary!$1:$1048576,56,1+INDEX(Data!$T:$T,MATCH(Sheet1!$N$2,Data!$R:$R,0)))","v":"kW"},null,{"$f":"INDEX(Dictionary!$1:$1048576,5,1+INDEX(Data!$T:$T,MATCH(Sheet1!$N$2,Data!$R:$R,0)))","v":"n/a"},{"$f":"INDEX(Dictionary!$1:$1048576,56,1+INDEX(Data!$T:$T,MATCH(Sheet1!$N$2,Data!$R:$R,0)))","v":"kW"},null,{"$f":"INDEX(Dictionary!$1:$1048576,5,1+INDEX(Data!$T:$T,MATCH(Sheet1!$N$2,Data!$R:$R,0)))","v":"n/a"},{"$f":"INDEX(Dictionary!$1:$1048576,56,1+INDEX(Data!$T:$T,MATCH(Sheet1!$N$2,Data!$R:$R,0)))","v":"kW"}]
[null,null,{"$f":"INDEX(Dictionary!$1:$1048576,48,1+INDEX(Data!$T:$T,MATCH(Sheet1!$N$2,Data!$R:$R,0)))","v":"Mass flow "},null,null,{"$f":"INDEX(Dictionary!$1:$1048576,5,1+INDEX(Data!$T:$T,MATCH(Sheet1!$N$2,Data!$R:$R,0)))","v":"n/a"},{"$f":"INDEX(Dictionary!$1:$1048576,57,1+INDEX(Data!$T:$T,MATCH(Sheet1!$N$2,Data!$R:$R,0)))","v":"kg/h"},null,{"$f":"INDEX(Dictionary!$1:$1048576,5,1+INDEX(Data!$T:$T,MATCH(Sheet1!$N$2,Data!$R:$R,0)))","v":"n/a"},{"$f":"INDEX(Dictionary!$1:$1048576,57,1+INDEX(Data!$T:$T,MATCH(Sheet1!$N$2,Data!$R:$R,0)))","v":"kg/h"},null,{"$f":"INDEX(Dictionary!$1:$1048576,5,1+INDEX(Data!$T:$T,MATCH(Sheet1!$N$2,Data!$R:$R,0)))","v":"n/a"},{"$f":"INDEX(Dictionary!$1:$1048576,57,1+INDEX(Data!$T:$T,MATCH(Sheet1!$N$2,Data!$R:$R,0)))","v":"kg/h"}]
[null,null,{"$f":"INDEX(Dictionary!$1:$1048576,49,1+INDEX(Data!$T:$T,MATCH(Sheet1!$N$2,Data!$R:$R,0)))","v":"Tevap."},null,null,{"$f":"INDEX(Dictionary!$1:$1048576,5,1+INDEX(Data!$T:$T,MATCH(Sheet1!$N$2,Data!$R:$R,0)))","v":"n/a"},{"$f":"INDEX(Dictionary!$1:$1048576,37,1+INDEX(Data!$T:$T,MATCH(Sheet1!$N$2,Data!$R:$R,0)))","v":"°C"},null,{"$f":"INDEX(Dictionary!$1:$1048576,5,1+INDEX(Data!$T:$T,MATCH(Sheet1!$N$2,Data!$R:$R,0)))","v":"n/a"},{"$f":"INDEX(Dictionary!$1:$1048576,37,1+INDEX(Data!$T:$T,MATCH(Sheet1!$N$2,Data!$R:$R,0)))","v":"°C"},null,{"$f":"INDEX(Dictionary!$1:$1048576,5,1+INDEX(Data!$T:$T,MATCH(Sheet1!$N$2,Data!$R:$R,0)))","v":"n/a"},{"$f":"INDEX(Dictionary!$1:$1048576,37,1+INDEX(Data!$T:$T,MATCH(Sheet1!$N$2,Data!$R:$R,0)))","v":"°C"}]
[null,null,{"$f":"INDEX(Dictionary!$1:$1048576,50,1+INDEX(Data!$T:$T,MATCH(Sheet1!$N$2,Data!$R:$R,0)))","v":"Tcond."},null,null,{"$f":"INDEX(Dictionary!$1:$1048576,5,1+INDEX(Data!$T:$T,MATCH(Sheet1!$N$2,Data!$R:$R,0)))","v":"n/a"},{"$f":"INDEX(Dictionary!$1:$1048576,37,1+INDEX(Data!$T:$T,MATCH(Sheet1!$N$2,Data!$R:$R,0)))","v":"°C"},null,{"$f":"INDEX(Dictionary!$1:$1048576,5,1+INDEX(Data!$T:$T,MATCH(Sheet1!$N$2,Data!$R:$R,0)))","v":"n/a"},{"$f":"INDEX(Dictionary!$1:$1048576,37,1+INDEX(Data!$T:$T,MATCH(Sheet1!$N$2,Data!$R:$R,0)))","v":"°C"},null,{"$f":"INDEX(Dictionary!$1:$1048576,5,1+INDEX(Data!$T:$T,MATCH(Sheet1!$N$2,Data!$R:$R,0)))","v":"n/a"},{"$f":"INDEX(Dictionary!$1:$1048576,37,1+INDEX(Data!$T:$T,MATCH(Sheet1!$N$2,Data!$R:$R,0)))","v":"°C"}]
[null,null,{"$f":"INDEX(Dictionary!$1:$1048576,51,1+INDEX(Data!$T:$T,MATCH(Sheet1!$N$2,Data!$R:$R,0)))","v":"Refrigerant"},null,null,"<select>",null,null,"<select>",null,null,"<select>"]
[null,null,{"$f":"INDEX(Dictionary!$1:$1048576,58,1+INDEX(Data!$T:$T,MATCH(Sheet1!$N$2,Data!$R:$R,0)))","v":"Heat exchanger design in tank"},null,null,{"$f":"INDEX(Dictionary!$1:$1048576,59,1+INDEX(Data!$T:$T,MATCH(Sheet1!$N$2,Data!$R:$R,0)))","v":"in-built"},null,null,{"$f":"INDEX(Dictionary!$1:$1048576,59,1+INDEX(Data!$T:$T,MATCH(Sheet1!$N$2,Data!$R:$R,0)))","v":"in-built"},null,null,{"$f":"INDEX(Dictionary!$1:$1048576,59,1+INDEX(Data!$T:$T,MATCH(Sheet1!$N$2,Data!$R:$R,0)))","v":"in-built"}]
[null,null,null,null,null,{"$f":"INDEX(Dictionary!$1:$1048576,60,1+INDEX(Data!$T:$T,MATCH(Sheet1!$N$2,Data!$R:$R,0)))","v":"external"},null,null,{"$f":"INDEX(Dictionary!$1:$1048576,60,1+INDEX(Data!$T:$T,MATCH(Sheet1!$N$2,Data!$R:$R,0)))","v":"external"},null,null,{"$f":"INDEX(Dictionary!$1:$1048576,60,1+INDEX(Data!$T:$T,MATCH(Sheet1!$N$2,Data!$R:$R,0)))","v":"external"}]
{"$rows_left_out":30}
{"sheet":"Data","index":1,"n_rows":17,"n_cols":26,"rows_kept":17,"cut":false,"hidden":false,"merged":[]}
[null,null,null,null,null,null,null,null,null,null,null,null,null,null,null,null,null,null,{"$f":"\"Data!R2:\"&\"R\"&(1+$S$2)","v":"Data!R2:R3"},null,null,null,null,3]
[null,{"$f":"INDEX(Dictionary!$1:$1048576,88,1+INDEX(Data!$T:$T,MATCH(Sheet1!$N$2,Data!$R:$R,0)))","v":"<select>"},null,null,{"$f":"INDEX(Dictionary!$1:$1048576,94,1+INDEX(Data!$T:$T,MATCH(Sheet1!$N$2,Data!$R:$R,0)))","v":"domestic water preheating"},null,null,{"$f":"INDEX(Dictionary!$1:$1048576,88,1+INDEX(Data!$T:$T,MATCH(Sheet1!$N$2,Data!$R:$R,0)))","v":"<select>"},null,null,null,{"$f":"INDEX(Dictionary!$1:$1048576,88,1+INDEX(Data!$T:$T,MATCH(Sheet1!$N$2,Data!$R:$R,0)))","v":"<select>"},null,{"$f":"INDEX(Dictionary!$1:$1048576,88,1+INDEX(Data!$T:$T,MATCH(Sheet1!$N$2,Data!$R:$R,0)))","v":"<select>"},null,{"$f":"INDEX(Dictionary!$1:$1048576,88,1+INDEX(Data!$T:$T,MATCH(Sheet1!$N$2,Data!$R:$R,0)))","v":"<select>"},null,"[EN]",{"$f":"COUNTA($R:$R)","v":2},1,null,null,null,null,null,"=INDEX(Dictionary!$1:$1048576;1;1+INDEX(Data!$T:$T;MATCH(Sheet1!$N$2;Data!$R:$R;0)))"]
[null,{"$f":"INDEX(Dictionary!$1:$1048576,89,1+INDEX(Data!$T:$T,MATCH(Sheet1!$N$2,Data!$R:$R,0)))","v":"domestic water"},null,null,{"$f":"INDEX(Dictionary!$1:$1048576,95,1+INDEX(Data!$T:$T,MATCH(Sheet1!$N$2,Data!$R:$R,0)))","v":"solar coil"},null,null,{"$f":"INDEX(Dictionary!$1:$1048576,94,1+INDEX(Data!$T:$T,MATCH(Sheet1!$N$2,Data!$R:$R,0)))","v":"domestic water preheating"},null,null,null,{"$f":"INDEX(Dictionary!$1:$1048576,101,1+INDEX(Data!$T:$T,MATCH(Sheet1!$N$2,Data!$R:$R,0)))","v":"Propane (R290)"},null,100,null,{"$f":"INDEX(Dictionary!$1:$1048576,115,1+INDEX(Data!$T:$T,MATCH(Sheet1!$N$2,Data!$R:$R,0)))","v":"S235JRG2 (1.0038) carbon steel outside painted "},null,"[RU]",{"$f":"INDIRECT(S1)","v":"[RU]"},2]
[null,{"$f":"INDEX(Dictionary!$1:$1048576,90,1+INDEX(Data!$T:$T,MATCH(Sheet1!$N$2,Data!$R:$R,0)))","v":"water"},null,null,{"$f":"INDEX(Dictionary!$1:$1048576,96,1+INDEX(Data!$T:$T,MATCH(Sheet1!$N$2,Data!$R:$R,0)))","v":"heat pump coil"},null,null,{"$f":"INDEX(Dictionary!$1:$1048576,99,1+INDEX(Data!$T:$T,MATCH(Sheet1!$N$2,Data!$R:$R,0)))","v":"heating water heating (additional user)"},null,null,null,{"$f":"INDEX(Dictionary!$1:$1048576,102,1+INDEX(Data!$T:$T,MATCH(Sheet1!$N$2,Data!$R:$R,0)))","v":"R134A"},null,150,null,{"$f":"INDEX(Dictionary!$1:$1048576,116,1+INDEX(Data!$T:$T,MATCH(Sheet1!$N$2,Data!$R:$R,0)))","v":"AISI304 (1.4301) stainless steel"},null,null,null,3]
[null,{"$f":"INDEX(Dictionary!$1:$1048576,91,1+INDEX(Data!$T:$T,MATCH(Sheet1!$N$2,Data!$R:$R,0)))","v":"ethylene glycol - water"},null,null,{"$f":"INDEX(Dictionary!$1:$1048576,97,1+INDEX(Data!$T:$T,MATCH(Sheet1!$N$2,Data!$R:$R,0)))","v":"floor heating"},null,null,{"$f":"INDEX(Dictionary!$1:$1048576,100,1+INDEX(Data!$T:$T,MATCH(Sheet1!$N$2,Data!$R:$R,0)))","v":"heating coil (additional heat source)"},null,null,null,{"$f":"INDEX(Dictionary!$1:$1048576,103,1+INDEX(Data!$T:$T,MATCH(Sheet1!$N$2,Data!$R:$R,0)))","v":"R404A"},null,200,null,{"$f":"INDEX(Dictionary!$1:$1048576,117,1+INDEX(Data!$T:$T,MATCH(Sheet1!$N$2,Data!$R:$R,0)))","v":"AISI316L (1.4404) stainless steel"},null,null,null,4]
[null,{"$f":"INDEX(Dictionary!$1:$1048576,92,1+INDEX(Data!$T:$T,MATCH(Sheet1!$N$2,Data!$R:$R,0)))","v":"propylene glycol - water"},null,null,{"$f":"INDEX(Dictionary!$1:$1048576,98,1+INDEX(Data!$T:$T,MATCH(Sheet1!$N$2,Data!$R:$R,0)))","v":"defrost"},null,null,null,null,null,null,{"$f":"INDEX(Dictionary!$1:$1048576,104,1+INDEX(Data!$T:$T,MATCH(Sheet1!$N$2,Data!$R:$R,0)))","v":"R410A"},null,300,null,null,null,null,null,5]
[null,{"$f":"INDEX(Dictionary!$1:$1048576,93,1+INDEX(Data!$T:$T,MATCH(Sheet1!$N$2,Data!$R:$R,0)))","v":"other"},null,null,null,null,null,null,null,null,null,{"$f":"INDEX(Dictionary!$1:$1048576,105,1+INDEX(Data!$T:$T,MATCH(Sheet1!$N$2,Data!$R:$R,0)))","v":"R22"},null,500]
[null,null,null,null,null,null,null,null,null,null,null,{"$f":"INDEX(Dictionary!$1:$1048576,106,1+INDEX(Data!$T:$T,MATCH(Sheet1!$N$2,Data!$R:$R,0)))","v":"R407A"},null,600]
[null,null,null,null,null,null,null,null,null,null,null,{"$f":"INDEX(Dictionary!$1:$1048576,107,1+INDEX(Data!$T:$T,MATCH(Sheet1!$N$2,Data!$R:$R,0)))","v":"R407C"},null,800]
[null,null,null,null,null,null,null,null,null,null,null,{"$f":"INDEX(Dictionary!$1:$1048576,108,1+INDEX(Data!$T:$T,MATCH(Sheet1!$N$2,Data!$R:$R,0)))","v":"R407F"},null,1000]
[null,null,null,null,null,null,null,null,null,null,null,{"$f":"INDEX(Dictionary!$1:$1048576,109,1+INDEX(Data!$T:$T,MATCH(Sheet1!$N$2,Data!$R:$R,0)))","v":"R407H"},null,1500]
[null,null,null,null,null,null,null,null,null,null,null,{"$f":"INDEX(Dictionary!$1:$1048576,110,1+INDEX(Data!$T:$T,MATCH(Sheet1!$N$2,Data!$R:$R,0)))","v":"R448A"},null,2000]
[null,null,null,null,null,null,null,null,null,null,null,{"$f":"INDEX(Dictionary!$1:$1048576,111,1+INDEX(Data!$T:$T,MATCH(Sheet1!$N$2,Data!$R:$R,0)))","v":"R449A"},null,2500]
[null,null,null,null,null,null,null,null,null,null,null,{"$f":"INDEX(Dictionary!$1:$1048576,112,1+INDEX(Data!$T:$T,MATCH(Sheet1!$N$2,Data!$R:$R,0)))","v":"R507A"},null,3000]
[null,null,null,null,null,null,null,null,null,null,null,{"$f":"INDEX(Dictionary!$1:$1048576,113,1+INDEX(Data!$T:$T,MATCH(Sheet1!$N$2,Data!$R:$R,0)))","v":"R513A"},null,4000]
[null,null,null,null,null,null,null,null,null,null,null,{"$f":"INDEX(Dictionary!$1:$1048576,114,1+INDEX(Data!$T:$T,MATCH(Sheet1!$N$2,Data!$R:$R,0)))","v":"R1234ze"},null,5000]
[null,null,null,null,null,null,null,null,null,null,null,{"$f":"INDEX(Dictionary!$1:$1048576,93,1+INDEX(Data!$T:$T,MATCH(Sheet1!$N$2,Data!$R:$R,0)))","v":"other"},null,{"$f":"INDEX(Dictionary!$1:$1048576,93,1+INDEX(Data!$T:$T,MATCH(Sheet1!$N$2,Data!$R:$R,0)))","v":"other"}]

{"sheet":"Dictionary","index":2,"n_rows":300,"n_cols":3,"rows_kept":300,"cut":false,"hidden":false,"merged":[]}
[1,"Heat recovery system quotation request","Запрос системы по отбору тепла"]
[2,"(please sent filled questionnaire to your regional sales manager)","(отправьте заполненную анкету менеджеру по продажам в вашем регионе)"]
[3,"Project name: ","Название проекта:"]
[4,"Customer: ","Заказчик:"]
[5,"n/a","н/д"]
[6,"Design priority:","Приоритет:"]
[7,"Application:","Применение:"]
[8,"Price","Цена"]
[9,"Domestic water heating ","Бытовое отопление водой"]
[10,"Heating (technical) water heating","Техническое отопление водой"]
[11,"Domestic and heating water heating (combi systems)","Бытовое и техническое отопление (комбинированные системы)"]
[12,"Efficiency (recover as much heat as possible)","Эффективность (максимально возможный отбор тепла)"]
[13,"Design conditions","Проектировочные условия"]
[14,"Restrictions for installation (max.):","Габаритные ограничения (макс.):"]
[15,"Installation","Установка"]
[16,"Position","Ориентация"]
[17,"L","Д"]
[18,"mm      x","мм      х"]
[19,"W","Ш"]
[20,"H","В"]
[21,"indoors","в помещении"]
[22,"vertical","вертикальная"]
[23,"outdoors","на открытом воздухе"]
[24,"horizontal","горизонтальная"]
[25,"Tank","Бак"]
[26,"Approx. hot water consumption","Прибл. расход горячей воды"]
[27,"Peak consumption of hot water","Пиковый расход горячей воды"]
[28,"Fluid (%)","Жидкость (%)"]
[29,"Fluid temperatures","Температура жидкости"]
[30,"Buffer tank volume","Объем накопительного бака"]
[31,"Material","Материал"]
[32,"Max. working pressure (Pmax.)","Макс. Рабочее давление (Pmax.)"]
[33,"Insulation","Изоляция"]
[34,"ltr./day","л / сут"]
[35,"ltr./hour","л / ч"]
[36,"%","%"]
[37,"°C","°C"]
[38,"in:","вход:"]
[39,"out:","выход:"]
[40,"ltr.","л"]
{"$rows_left_out":260}